Articles

Error C2375 Winsock

RECOMMENDED: If you have Windows errors then we strongly recommend that you download and run this (Windows) Repair Tool.

Linking problem with WinSock2?. (1626) : error C2375: 'accept' :. F:\PSDK\Include\winsock.h(918) : see.

404 Error Viewer IIS Logs, Error Logs and More – 6 Ways to Find Failed. – Your web app is throwing some sort of error, but you can’t find it in your IIS logs. Find out how to troubleshoot IIS or ASP.NET errors on your servers. Sign-up for the CBS4 Viewer Panel to give feedback on our upcoming

Including winsock2.h, in a file of a project. Getting many errors in – WinSock2.h(109) : error C2011: 'fd_set' : 'struct' type redefinition with a corresponding.

I cannot include WinSock2.h in a msvc++2010 project. At first I though it was something I was doing wrong, so I created an empty project to test my sanity. The empty.

. エラーが出たのですか? WinSock API群であれ,CAsyncSocket系統であれ,. error C2375: 'WSACancelAsyncRequest' : 再定義されています。

Oct 6, 2009. multicast.c I:devaprnetwork_iounixmulticast.c(137) : error C2079: 'mip' uses. FilesMicrosoft SDKsWindowsv6.1Includewinsock.h(460) : see previous. error C2375: 'connect' : redefinition; different linkage C:Program.

MySQL for Python / Discussion / Open Discussion:'my_config.h' not. – Jan 28, 2009. error: command '"c:Program Files (x86)Microsoft Visual Studio. SDKsWindows v6.0Aincludewinsock2.h(1527) : error C2375: 'accept'. Apparently, the fix is to remove all references to winsock.h from the source.

WinSock problems. – Software Development | DaniWeb – WinSock problems. 0. (1448) : error C2375: 'bind' : redefinition;. //starting up the winsock library, error checking if (WSAStartup.

2015년 4월 8일. sdkswindowsv7.0aincludewinsock2.h(1815): error C2375: 'listen'. (x86) microsoft sdkswindowsv7.0aincludewinsock.h(789) : 'listen'.

I have a project which contains 5 header files and 5 cpp files. Now there are some header files which are required among the cpp files and hence are added.

As others suggested, the problem is when windows.h is included before WinSock2.h. Because windows.h includes winsock.h. You can not use both WinSock2.h and winsock…

Apr 1, 2016. for Python9.0WinSDKIncludewinsock.h(460) : see previous definition of. for Python9.0WinSDKIncludewinsock2.h(1578) : error C2375:.

Event Error 1509 I have several warnings and errors on servers in the Operations Manager event log: Error Source: HealthService Event ID: 4503 A module reported an error. Copying default profile for new users fails with "The process cannot access the. Winlogon emits event. and the user profile service emits several of 1509: allTURNatives: Form + Spirit 2017

virtualbox.org • View topic – Building VirtualBox OSE 4.2.0 on. – Apr 19, 2013. fatal error: RTR3Init: VERR_VM_DRIVER_NOT_INSTALLED. C:PROGRA~1 MIA713~1Windowsv7.0Includewinsock.h(460) : see previous definition of ' AF_IPX'. error C2375: 'accept' : redefinition; different linkage

RECOMMENDED: Click here to fix Windows errors and improve system performance