Articles

Error C4430 Missing Type Specifier

RECOMMENDED: If you have Windows errors then we strongly recommend that you download and run this (Windows) Repair Tool.

c++ – Compiler error C4430: missing type specifier – int. – I have this error: "error C4430: missing type specifier – int assumed. Note: C++ does not support default-int" with this code example : //A.h #include "B.h" class.

Search for Error C4430 Missing Type. Look Up Quick Answers Now!

At the top of the file, I have: #include "vector.h" then I do a: vector<vtarg> targVector; and got the following error Cannot open include file: ‘vector.h’: No.

Nov 7, 2012. 1>c:usersdrbuckodocumentsvisual studio 2012projectsproject2project2 source.cu(3): error C4430: missing type specifier – int assumed.

Mar 29, 2012  · Connecting to a local MYSQL database is the same as connecting to a remote database. PHP is one the languages that have binding to MYSQL – go the MYSQL website for.

Jul 16, 2009  · When your program needs to access a service, web site, or API that requires a username and password login, how can you store the password so that it.

Pokemon Wifi Connection Error 51099 Sorry I was confused. Tap on "Test Connection" and if the Nintendo DS wifi error code 51099 still appears. Yes, my password is: Forgot your password? For all other players, turning off your cellular connection and playing only from Wifi might help some of the. In the past, Android users who encountered this error might

When trying to compile this project, I get 2 errors that I can't figure how to solve. 1>initialization.h(6): error C4430: missing type specifier – int assumed. Note.

Jun 1, 2010. Note: C++ does not support default-int > 1>c:fileswpdpack_4_1_1wpdpack includepcapbpf.h(68) : error C4430: > missing type specifier – int.

Oct 21, 2013  · You forgot # before include and when you run it the screen will show up a bit and then disappear to stop this. My advice is to use system(‘pause’); and return 0.

When you upgrade to a new version of the Visual C++ compiler, you might encounter compilation and/or runtime errors in code that previously compiled and ran correctly.

Note: C++ does not support default-int 1>d:sourcesrmermesourcegraphics.h( 64): error C4430: missing type specifier – int assumed.

An integer type (sometimes called an integral type) variable is a variable that can only hold non-fractional numbers (e.g. -2, -1, 0, 1, 2). C++ has five different.

Feb 23, 2016. QtOpenGLDepends c:tempqtqtbaseincludeqtgui././src/gui/opengl/ qopengles2ext.h(22): error C4430: missing type specifier – int assumed.

Помогите, как исправить данную ошибку. error C4430: missing type specifier – int assumed. Note: C++ does not support default-int Писала.

Apr 16, 2012. 1>stdafx.cpp 1>c:/program files/microsoft sdks/windows/v6.0a/include/ gdiplusimaging.h(74) : error C4430: missing type specifier – int assumed.

Error Code In Sql Server 2000 Most iterative language compilers have built-in error handling routines (e.g., TRY…CATCH statements) that developers can leverage when designing their code. Although SQL Server 2000 developers don’t enjoy the luxury that iterative. The Events and Errors Message Center, located at this Microsoft Web site, is the primary source of information on error messages for SQL Server

Compiler Warning C4430. The latest version of this topic can be found at Compiler Warning C4430. missing type specifier. C4430 is always issued as an error.

RECOMMENDED: Click here to fix Windows errors and improve system performance