Articles

Error Failed Dependencies Rtldgnu_hash

RECOMMENDED: If you have Windows errors then we strongly recommend that you download and run this (Windows) Repair Tool.

Error 403 Authentication Failed Websphere Aug 26, 2007. returns tomcat error page, (403)Access to the requested resource. call was failing due due to SOAP Authentication failure at Portal Realm. ERROR: ws_common: websphereExecute: Failed to create the stream. WebSphere and IBM Http Server, part-3 : Client Authentication and Ciphers. Required – The server requires a valid certificate from all clients and

Sep 09, 2008  · rtld(GNU_HASH) Please help me!. Failed dependencies: rtld(GNU_HASH). The error message says you’re missing the rtld package.

Blackberry Application Error 523 Uncaught Exception Feb 05, 2012  · . or normal operational mode I receive an error: "Uncaught exception:. a BlackBerry 8900 Curve and when either booted. BlackBerry 8900 Curve "App Error 523. Home > uncaught exception > uncaught exception blackberry error 523 Uncaught Exception Blackberry. application related problem. blackberry-os-apps-f35/uncaught. have bb 9300 with app error 523. now powers up

The Setup Log dd_setup_ _errors.log will show an error similar to this: Package ‘Win10SDK_10.0.14393.795,version=10.0.14393.79501’ failed to install. This is caused by missing dependencies. If.

Linux Kernel – At a previous job, I spent weeks debugging problems caused by a bad (but well-meaning) monkey-patch made by one of our dependencies. So why did ‘m’ still type ‘m’? semantic error: failed to retrieve location attribute for ‘event’ This.

rtld(GNU_HASH) Please help me!. Failed dependencies: rtld(GNU_HASH). The error message says you're missing the rtld package.

The error message says you're missing the rtld package. still a newbie myself but want to help if I can, Amy Page 1 of 2 1 2 Last Jump to page: Quick Navigation.

Error Failed Dependencies Rtld. Update was made via yum. whats the command to check what linux i have?. Newbie rtld(GNU_HASH) Please help me!

There are many reasons why build duration can be higher when using a build service: When running your build locally, many things are cached (e.g. NuGet packages, pods, dependencies. x86_64 clang: error: linker command failed.

maven plugin – clean failed: Plugin org.codehaus.mojo:cobertura-maven-plugin:2.7 or one of its dependencies could not be resolved: Could not find artifact com.sun:tools:jar:0.

Feb 07, 2007  · we tryed to install radiusclient-ng-0.5.2-4.i386.rpm on centos 4.4 but we get every time an error back: error: Failed dependencies: rtld(GNU_HASH).

KB196: 64bit Linux failed dependencies: rtld(GNU_HASH) – KB196: 64bit Linux failed dependencies: rtld(GNU_HASH) Print. Views: 3465. Votes: 1. Posted. When you install the 64bit linux rpm the following error is displayed:

Error Unhandled Exception Inventor Unhandled Exception: System.IO.FileLoadException. See: https://stackoverflow.com/questions/46599363/netstandard-class-library-referenced-in-wpf-sign-error-in-xaml-at. Outlook Email Editor Error When using Outlook, many people complain that sometimes they receive blank emails. Yes, blank emails, which have no content, some of them event doesn’t have a "Subject" field, "To" field or the "From". If you have ever received. The jobs outlook shifting in favour of Queenslanders

Jun 17, 2008  · Error: Missing Dependency: rtld(GNU_HASH) is. i have installed hylafax-4.3.4-1rhel4.i386f or sme7.3 but i was getting error Error: Missing Dependency: rtld(GNU.

I'm trying to install a package but can't seem to complete the process. I receive the following error when I attempt to install. Error: Missing Dependency: rtld(GNU.

RECOMMENDED: Click here to fix Windows errors and improve system performance