Articles

Esyexception In Modulecall Esapinstexception Error Text Undefined

RECOMMENDED: If you have Windows errors then we strongly recommend that you download and run this (Windows) Repair Tool.

Iss Exe Error Error Access To Tools Dp.sc Was Denied It say that access to toolsdp.sc was denied OR something about. Dell Inspiron what happened was i randomly got an error while searching on internet and it. After I click on "Yes, refomat hard drive and restore system software to factory condition", I receive the following message: "PC
Error Sintactico Bison GNU bison es un programa generador de analizadores sintácticos de propósito general. de contexto LALR, en un programa en C, C++, o Java que realiza análisis sintáctico. Portada · Portal de la comunidad · Actualidad · Cambios recientes · Páginas nuevas · Página aleatoria · Ayuda · Donaciones · Notificar un error. Oct 22, 2013.

Jul 17, 2008. MUT-03025 Caught ESyException in Modulecall: ESAPinstException: error text undefined. ERROR 2008-07-16 09:19:43. FCO-00011 The step.

Installation error in phase " Install DBA Tools -. – MUT-03025 Caught ESyException in Modulecall: ESAPinstException: error text undefined. ERROR 2009-01-12 09:58:34. Installation error in phase " Install.

Home Sap Caught Esyexception In Modulecall Esapinstexception Error Text Undefined. In Modulecall Esapinstexception Error Text. ESyException try the.

NW7 SR3 Installation Error – Toolbox for IT Groups – Error: INFO 2009-10-13 22. ERROR 2009-10-13 22:29:23.218 MUT-03025 Caught ESyException in Modulecall: ESAPinstException: error text undefined.

Installation Error – SAP – At RHEL 4.0 i am installing database but i found a error in second. MUT-03025 Caught ESyException in Modulecall: ESAPinstException: error text undefined. ERROR.

Mar 26, 2010. MUT-03025 Caught ESyException in Modulecall: ESAPinstException: error text undefined. ERROR 2010-03-26 12:50:48.218. FCO-00011 The.

‘Using custom value info for property SAPINST MESSAGE CONSOLE THRESHOLD’. ESAPinstException: error text undefined. Modulecall: ESAPinstException: error text.

Oct 13, 2009. FSL-06002 Error 3 (The system cannot find the path specified. ). Caught ESyException in Modulecall: ESAPinstException: error text undefined.

Hi,In the installation of NW04s at the unpack SAP. ESAPinstException: error text undefined. MUT-03025 Caught ESyException in Modulecall: ESAPinstException:.

Trouble with installation Sneak Preview SAP NetWeaver 2004s. Trouble with installation Sneak Preview SAP NetWeaver. ESAPinstException: error text undefined.

Error at SAP Installation at. 2010-03-26 12:50:48.133 MUT-03025 Caught ESyException in Modulecall: ESAPinstException: error text undefined. ERROR 2010-03-26 12.

ERROR 2008 01 16 183018 FSL 05014 Command usrsbinusermod with. ESyException in Modulecall: ESAPinstException: error text undefined. ERROR.

MSC-01003 ESyException: ESAPinstException: error text undefined. MUT-03025 Caught ESyException in Modulecall: ESAPinstException: error text undefined.

MUT-03025 Caught ESyException in Modulecall: ESAPinstException: error text undefined. LSMW MM01 Error Message M3189 The.

RECOMMENDED: Click here to fix Windows errors and improve system performance