Articles

Junit Assertion Failed Error

RECOMMENDED: If you have Windows errors then we strongly recommend that you download and run this (Windows) Repair Tool.

Reference. This is the general reference for all Cucumber implementations. Please refer to the documentation overview for links to platform-specific documentation.

JUnit, Assertion Failed Error – Experts-Exchange – Hi there, Using Eclipse I'm writing a program to test web pages in Java, with JUnit and HttpUnit. I'm trying to click on a submit button (button1) inside a.

junit.framework Class AssertionFailedError. +–junit.framework.AssertionFailedError. extends java.lang.Error. Thrown when an assertion failed.

Nov 18, 2010. The bug is that ComparisonFailure extends junit.framework.AssertionFailedError, which originally extended java.lang.Error but now extends.

Error File Ntwdblib Dll Home > Bde Error > Bde Error Ntwdblib.dll Bde Error Ntwdblib.dll. Vendor initialization failed Cannot load an IDAPI service library File: NTWDBLIB.DLL BDE error:. Press Ctrl Alt Del to restart. Hal.dll is missing or corrupt. Please re-install a copy of the above file. NTLDR is missing. Press any key to restart. Search Lifewire or browse

Class AssertionFailedError. java.lang.Object | +–java.lang.Throwable | +–java. lang.Error | +–junit.framework.AssertionFailedError. All Implemented Interfaces:.

This page provides Java code examples for junit.framework.AssertionFailedError. The examples are extracted from open source Java projects from GitHub.

In this article, you can find Selenium Interview Questions which is useful for experienced as well fresher. It contained Selenium IDE, WebDriver, RC, Grid.

112 Responses to “How to run parallel tests with Selenium WebDriver and TestNG”

If an assertion in a test method fails. The result of the test driver should be either “all tests OK” or “these tests failed:.” A good testing framework, like JUnit, helps you build automated test suites. Note that automated testing.

Parse Error In Udf Fluent Since the web service returns a JSON table, I parse the results and write them to a DB2 table so. This article showed how to use SQL to consume a REST service using the UDF HTTPGETCLOB. As mentioned, there are many other. Jun 20, 2017. accurate numerical computation without any error. 8. Chapter 1. Imagine
Ipt_ulog Error During Nlmsg_put ipt_ULOG: error during NLMSG_PUT; NET: 9 messages suppressed. ipt_ULOG: error during NLMSG_PUT; NET: 9 messages suppressed. ipt_ULOG: error during NLMSG_PUT; Bits Error 126 Vista FastPictureViewer Professional 1.9.360.0 Downloads – Apr 25, 2017 An image viewer built for speed. Designed for digital photographers. Fastest, EVER, helps. Apr 12, 2010. On Windows Vista and above, the sfc

SimpleTest for PHP. The following assumes that you are familiar with the concept of unit testing as well as the PHP web development language.

Sep 2, 2013. You're comparing Object references. Either use Arrays.equals to compare array content. Assert.assertTrue(Arrays.equals(expected, actual));.

Nov 10, 2014. junit.framework.AssertionFailedError: expected: but was:. kluever added a commit to kluever/junit that referenced this issue on Nov 11, 2014.

3. Elements of a Test Plan. This section describes the different parts of a test plan. A minimal test will consist of the Test Plan, a Thread Group and one or more.

junit.framework.AssertionFailedError while doing. I get the following error: Exception in thread "main" junit. (Assert.java:57) at junit.framework.Assert.

I'm new to JUnit and am trying to get some tests running. I have the following codes. After running the codes the test failed and shows AssertionFailedError: null.

Normally, to read a data in excel, first we should have access to workbook, sheet which we want to read as workbook contains multiple sheets and if you want to read a.

RECOMMENDED: Click here to fix Windows errors and improve system performance